Target
Thymidylate synthase
Ligand
BDBM50049291
Substrate
Meas. Tech.
ChEMBL_209813 (CHEMBL815678)
IC50
10±n/a nM
Citation
 Hennequin, LFBoyle, FTWardleworth, JMMarsham, PRKimbell, RJackman, AL Quinazoline antifolates thymidylate synthase inhibitors: lipophilic analogues with modification to the C2-methyl substituent. J Med Chem 39:695-704 (1996)  
Target
Name:
Thymidylate synthase
Synonyms:
TS TYSY_MOUSE | Tyms
Type:
PROTEIN
Mol. Mass.:
34957.15
Organism:
Mus musculus
Description:
ChEMBL_1340097
Residue:
307
  
Inhibitor
Name:
BDBM50049291
Synonyms:
2-{4-[(2-Methyl-4-oxo-3,4-dihydro-quinazolin-6-ylmethyl)-prop-2-ynyl-amino]-benzoylamino}-3-(3-nitro-phenyl)-propionic acid | CHEMBL348765
Type:
Small organic molecule
Emp. Form.:
C29H25N5O6
Mol. Mass.:
539.5387
SMILES:
Cc1nc2ccc(CN(CC#C)c3ccc(cc3)C(=O)NC(Cc3cccc(c3)[N+]([O-])=O)C(O)=O)cc2c(=O)[nH]1
: