Target
Adenosine receptor A3
Ligand
BDBM50049399
Substrate
Meas. Tech.
ChEMBL_32014 (CHEMBL649050)
Ki
2650±n/a nM
Citation
 Ji, XDMelman, NJacobson, KA Interactions of flavonoids and other phytochemicals with adenosine receptors. J Med Chem 39:781-8 (1996)  
Target
Name:
Adenosine receptor A3
Synonyms:
A3 adenosine receptor (hA3) ADORA3 | Adenosine A3 receptor (A3AR)
Type:
G Protein-Coupled Receptor (GPCR)
Mol. Mass.:
36197.32
Organism:
Homo sapiens (Human)
Description:
P0DMS8
Residue:
318
  
Inhibitor
Name:
BDBM50049399
Synonyms:
2-(2,4-Dimethoxy-phenyl)-3,5,7-trimethoxy-chromen-4-one | CHEMBL75169
Type:
Small organic molecule
Emp. Form.:
C20H20O7
Mol. Mass.:
372.3686
SMILES:
COc1ccc(c(OC)c1)-c1oc2cc(OC)cc(OC)c2c(=O)c1OC
: