Target
Neuraminidase
Ligand
BDBM5025
Substrate
Meas. Tech.
ChEMBL_1541519 (CHEMBL3744082)
IC50
79940±n/a nM
Citation
 Boechat, Fda CSacramento, CQCunha, ACSagrillo, FSNogueira, CMFintelman-Rodrigues, NSantos-Filho, ORiscado, CSForezi, Lda SFaro, LVBrozeguini, LMarques, IPFerreira, VFSouza, TMde Souza, MC 1,2,3-Triazolyl-4-oxoquinolines: A feasible beginning for promising chemical structures to inhibit oseltamivir-resistant influenza A and B viruses. Bioorg Med Chem 23:7777-84 (2015)  
Target
Name:
Neuraminidase
Synonyms:
NA | NRAM_I33A0
Type:
PROTEIN
Mol. Mass.:
49687.56
Organism:
Influenza A virus
Description:
ChEMBL_1347422
Residue:
453
  
Inhibitor
Name:
BDBM5025
Synonyms:
Oseltamivir ethyl (3R,4R,5S)-5-amino-4-acetamido-3-(pentan-3-yloxy)cyclohex-1-ene-1-carboxylate
Type:
Small organic molecule
Emp. Form.:
C16H28N2O4
Mol. Mass.:
312.4045
SMILES:
[H][C@@]1(OC(CC)CC)C=C(C[C@H](N)[C@H]1NC(C)=O)C(=O)OCC
: