Target
Amine oxidase [flavin-containing] A
Ligand
BDBM50049694
Substrate
Meas. Tech.
ChEMBL_123444 (CHEMBL731835)
Ki
80±n/a nM
Citation
 Harfenist, MHeuser, DJJoyner, CTBatchelor, JFWhite, HL Selective inhibitors of monoamine oxidase. 3. Structure-activity relationship of tricyclics bearing imidazoline, oxadiazole, or tetrazole groups. J Med Chem 39:1857-63 (1996)  
Target
Name:
Amine oxidase [flavin-containing] A
Synonyms:
AOFA_RAT Amine oxidase [flavin-containing] A Monoamine Oxidase Type A (MAO-A) Monoamine oxidase A (MAO-A) Monoamine oxidase type A (MAOA)
Type:
Enzyme
Mol. Mass.:
59515.21
Organism:
Rattus norvegicus (rat)
Description:
Residue:
526
  
Inhibitor
Name:
BDBM50049694
Synonyms:
3-(4,5-Dihydro-1H-imidazol-2-yl)-10,10-dioxo-10H-10lambda*6*-thioxanthen-9-one | CHEMBL56007
Type:
Small organic molecule
Emp. Form.:
C16H12N2O3S
Mol. Mass.:
312.343
SMILES:
O=C1c2ccccc2S(=O)(=O)c2cc(ccc12)C1=NCCN1
: