Target
Cytochrome P450 11B2, mitochondrial
Ligand
BDBM50500185
Substrate
Meas. Tech.
ChEMBL_1545198 (CHEMBL3750679)
IC50
3900±n/a nM
Citation
 Papillon, JPLou, CSingh, AKAdams, CMKsander, GMBeil, MEChen, WLeung-Chu, JFu, FGan, LHu, CWJeng, AYLaSala, DLiang, GRigel, DFRussell, KSVest, JAWatson, C Discovery of N-[5-(6-Chloro-3-cyano-1-methyl-1H-indol-2-yl)-pyridin-3-ylmethyl]-ethanesulfonamide, a Cortisol-Sparing CYP11B2 Inhibitor that Lowers Aldosterone in Human Subjects. J Med Chem 58:9382-94 (2015)  
Target
Name:
Cytochrome P450 11B2, mitochondrial
Synonyms:
Aldosterone synthase CYPXIB2 Cyp11b2 Cytochrome P450 11B2 P450-Aldo-1 | Steroid 11-beta-hydroxylase
Type:
PROTEIN
Mol. Mass.:
58260.64
Organism:
Rattus norvegicus
Description:
ChEMBL_224979
Residue:
510
  
Inhibitor
Name:
BDBM50500185
Synonyms:
CHEMBL3746125
Type:
Small organic molecule
Emp. Form.:
C14H12N2
Mol. Mass.:
208.2585
SMILES:
Cc1c([nH]c2ccccc12)-c1cccnc1
: