Target
Transitional endoplasmic reticulum ATPase
Ligand
BDBM50500324
Substrate
Meas. Tech.
ChEMBL_1545548 (CHEMBL3749463)
IC50
6.0±n/a nM
Citation
 Zhou, HJWang, JYao, BWong, SDjakovic, SKumar, BRice, JValle, ESoriano, FMenon, MKMadriaga, AKiss von Soly, SKumar, AParlati, FYakes, FMShawver, LLe Moigne, RAnderson, DJRolfe, MWustrow, D Discovery of a First-in-Class, Potent, Selective, and Orally Bioavailable Inhibitor of the p97 AAA ATPase (CB-5083). J Med Chem 58:9480-97 (2015)  
Target
Name:
Transitional endoplasmic reticulum ATPase
Synonyms:
TERA_HUMAN VCP Valosin-containing protein
Type:
Enzyme
Mol. Mass.:
89300.63
Organism:
Homo sapiens (Human)
Description:
P55072
Residue:
806
  
Inhibitor
Name:
BDBM50500324
Synonyms:
CHEMBL3747448
Type:
Small organic molecule
Emp. Form.:
C25H25N5O
Mol. Mass.:
411.4989
SMILES:
Cc1cc2c(cccc2n1-c1nc2CCCCc2c(NCc2ccccc2)n1)C(N)=O
: