Target
Transitional endoplasmic reticulum ATPase
Ligand
BDBM50500325
Substrate
Meas. Tech.
ChEMBL_1545548 (CHEMBL3749463)
IC50
11±n/a nM
Citation
 Zhou, HJWang, JYao, BWong, SDjakovic, SKumar, BRice, JValle, ESoriano, FMenon, MKMadriaga, AKiss von Soly, SKumar, AParlati, FYakes, FMShawver, LLe Moigne, RAnderson, DJRolfe, MWustrow, D Discovery of a First-in-Class, Potent, Selective, and Orally Bioavailable Inhibitor of the p97 AAA ATPase (CB-5083). J Med Chem 58:9480-97 (2015)  
Target
Name:
Transitional endoplasmic reticulum ATPase
Synonyms:
TERA_HUMAN VCP Valosin-containing protein
Type:
Enzyme
Mol. Mass.:
89300.63
Organism:
Homo sapiens (Human)
Description:
P55072
Residue:
806
  
Inhibitor
Name:
BDBM50500325
Synonyms:
Cb 5083 | Cb-5083
Type:
Small organic molecule
Emp. Form.:
C24H23N5O2
Mol. Mass.:
413.4717
SMILES:
Cc1cc2c(cccc2n1-c1nc2CCOCc2c(NCc2ccccc2)n1)C(N)=O
: