Target
Endothelin receptor type B
Ligand
BDBM50050001
Substrate
Meas. Tech.
ChEMBL_64007 (CHEMBL671388)
IC50
13000±n/a nM
Citation
 von Geldern, TWKester, JABal, RWu-Wong, JRChiou, WDixon, DBOpgenorth, TJ Azole endothelin antagonists. 2. Structure-activity studies. J Med Chem 39:968-81 (1996)  
Target
Name:
Endothelin receptor type B
Synonyms:
EDNRB Endothelin receptor ET-B
Type:
PROTEIN
Mol. Mass.:
49616.89
Organism:
Sus scrofa
Description:
ChEMBL_63872
Residue:
443
  
Inhibitor
Name:
BDBM50050001
Synonyms:
5-Methyl-2-((R)-2-(1-methyl-1H-indol-3-yl)-1-{(S)-4-methyl-2-[3-(2-methyl-cyclohexyl)-ureido]-pentanoylamino}-ethyl)-1H-imidazole-4-carboxylic acid | CHEMBL366544
Type:
Small organic molecule
Emp. Form.:
C30H42N6O4
Mol. Mass.:
550.6923
SMILES:
CC(C)C[C@H](NC(=O)NC1CCCCC1C)C(=O)N[C@H](Cc1cn(C)c2ccccc12)c1nc(C(O)=O)c(C)[nH]1
: