Target
Dihydrofolate reductase
Ligand
BDBM50050403
Substrate
Meas. Tech.
ChEMBL_55115 (CHEMBL665442)
IC50
230±n/a nM
Citation
 Piper, JRJohnson, CAKrauth, CACarter, RLHosmer, CAQueener, SFBorotz, SEPfefferkorn, ER Lipophilic antifolates as agents against opportunistic infections. 1. Agents superior to trimetrexate and piritrexim against Toxoplasma gondii and Pneumocystis carinii in in vitro evaluations. J Med Chem 39:1271-80 (1996)  
Target
Name:
Dihydrofolate reductase
Synonyms:
DYR_RAT Dihydrofolate reductase (DHFR) Tetrahydrofolate dehydrogenase
Type:
Enzyme
Mol. Mass.:
21638.84
Organism:
Rattus norvegicus (rat)
Description:
Residue:
187
  
Inhibitor
Name:
BDBM50050403
Synonyms:
6-{[(2-Methoxy-5-trifluoromethyl-phenyl)-methyl-amino]-methyl}-5-methyl-pyrido[2,3-d]pyrimidine-2,4-diamine | CHEMBL23076
Type:
Small organic molecule
Emp. Form.:
C18H19F3N6O
Mol. Mass.:
392.3783
SMILES:
COc1ccc(cc1N(C)Cc1cnc2nc(N)nc(N)c2c1C)C(F)(F)F
: