Target
cGMP-specific 3',5'-cyclic phosphodiesterase
Ligand
BDBM50050598
Substrate
Meas. Tech.
ChEMBL_192642 (CHEMBL798774)
EC50
350±n/a nM
Citation
 Dumaître, BDodic, N Synthesis and cyclic GMP phosphodiesterase inhibitory activity of a series of 6-phenylpyrazolo[3,4-d]pyrimidones. J Med Chem 39:1635-44 (1996)  
Target
Name:
cGMP-specific 3',5'-cyclic phosphodiesterase
Synonyms:
PDE5A_RAT Pde5a | Phosphodiesterase 5A
Type:
PROTEIN
Mol. Mass.:
94547.60
Organism:
Rattus norvegicus
Description:
ChEMBL_155367
Residue:
833
  
Inhibitor
Name:
BDBM50050598
Synonyms:
CHEMBL45367 | N-[3-(1,3-Dimethyl-4-oxo-4,5-dihydro-1H-pyrazolo[3,4-d]pyrimidin-6-yl)-4-propoxy-phenyl]-methanesulfonamide
Type:
Small organic molecule
Emp. Form.:
C17H21N5O4S
Mol. Mass.:
391.445
SMILES:
CCCOc1ccc(NS(C)(=O)=O)cc1-c1nc2n(C)nc(C)c2c(=O)[nH]1
: