Target
cGMP-specific 3',5'-cyclic phosphodiesterase
Ligand
BDBM50050611
Substrate
Meas. Tech.
ChEMBL_192642 (CHEMBL798774)
EC50
200±n/a nM
Citation
 Dumaître, BDodic, N Synthesis and cyclic GMP phosphodiesterase inhibitory activity of a series of 6-phenylpyrazolo[3,4-d]pyrimidones. J Med Chem 39:1635-44 (1996)  
Target
Name:
cGMP-specific 3',5'-cyclic phosphodiesterase
Synonyms:
PDE5A_RAT Pde5a | Phosphodiesterase 5A
Type:
PROTEIN
Mol. Mass.:
94547.60
Organism:
Rattus norvegicus
Description:
ChEMBL_155367
Residue:
833
  
Inhibitor
Name:
BDBM50050611
Synonyms:
1,3-Dimethyl-6-[5-(2-methyl-thiazol-4-yl)-2-propoxy-phenyl]-1,5-dihydro-pyrazolo[3,4-d]pyrimidin-4-one | CHEMBL296071
Type:
Small organic molecule
Emp. Form.:
C20H21N5O2S
Mol. Mass.:
395.478
SMILES:
CCCOc1ccc(cc1-c1nc2n(C)nc(C)c2c(=O)[nH]1)-c1csc(C)n1
: