Target
cGMP-specific 3',5'-cyclic phosphodiesterase
Ligand
BDBM50050617
Substrate
Meas. Tech.
ChEMBL_192642 (CHEMBL798774)
EC50
20±n/a nM
Citation
 Dumaître, BDodic, N Synthesis and cyclic GMP phosphodiesterase inhibitory activity of a series of 6-phenylpyrazolo[3,4-d]pyrimidones. J Med Chem 39:1635-44 (1996)  
Target
Name:
cGMP-specific 3',5'-cyclic phosphodiesterase
Synonyms:
PDE5A_RAT Pde5a | Phosphodiesterase 5A
Type:
PROTEIN
Mol. Mass.:
94547.60
Organism:
Rattus norvegicus
Description:
ChEMBL_155367
Residue:
833
  
Inhibitor
Name:
BDBM50050617
Synonyms:
6-(5-Amino-2-propoxy-phenyl)-1-ethyl-3-methyl-1,5-dihydro-pyrazolo[3,4-d]pyrimidin-4-one | CHEMBL439923
Type:
Small organic molecule
Emp. Form.:
C17H21N5O2
Mol. Mass.:
327.3809
SMILES:
CCCOc1ccc(N)cc1-c1nc2n(CC)nc(C)c2c(=O)[nH]1
: