Target
cGMP-specific 3',5'-cyclic phosphodiesterase
Ligand
BDBM50050607
Substrate
Meas. Tech.
ChEMBL_192642 (CHEMBL798774)
EC50
200±n/a nM
Citation
 Dumaître, BDodic, N Synthesis and cyclic GMP phosphodiesterase inhibitory activity of a series of 6-phenylpyrazolo[3,4-d]pyrimidones. J Med Chem 39:1635-44 (1996)  
Target
Name:
cGMP-specific 3',5'-cyclic phosphodiesterase
Synonyms:
PDE5A_RAT Pde5a | Phosphodiesterase 5A
Type:
PROTEIN
Mol. Mass.:
94547.60
Organism:
Rattus norvegicus
Description:
ChEMBL_155367
Residue:
833
  
Inhibitor
Name:
BDBM50050607
Synonyms:
1,3-Dimethyl-6-(2-propoxy-phenyl)-1,5-dihydro-pyrazolo[3,4-d]pyrimidin-4-one | CHEMBL42680
Type:
Small organic molecule
Emp. Form.:
C16H18N4O2
Mol. Mass.:
298.3397
SMILES:
CCCOc1ccccc1-c1nc2n(C)nc(C)c2c(=O)[nH]1
: