Target
cGMP-specific 3',5'-cyclic phosphodiesterase
Ligand
BDBM50050614
Substrate
Meas. Tech.
ChEMBL_192642 (CHEMBL798774)
EC50
200±n/a nM
Citation
 Dumaître, BDodic, N Synthesis and cyclic GMP phosphodiesterase inhibitory activity of a series of 6-phenylpyrazolo[3,4-d]pyrimidones. J Med Chem 39:1635-44 (1996)  
Target
Name:
cGMP-specific 3',5'-cyclic phosphodiesterase
Synonyms:
PDE5A_RAT Pde5a | Phosphodiesterase 5A
Type:
PROTEIN
Mol. Mass.:
94547.60
Organism:
Rattus norvegicus
Description:
ChEMBL_155367
Residue:
833
  
Inhibitor
Name:
BDBM50050614
Synonyms:
1-Ethyl-3-methyl-6-[5-(2-phenyl-thiazol-4-yl)-2-propoxy-phenyl]-1,5-dihydro-pyrazolo[3,4-d]pyrimidin-4-one | CHEMBL297763
Type:
Small organic molecule
Emp. Form.:
C26H25N5O2S
Mol. Mass.:
471.574
SMILES:
CCCOc1ccc(cc1-c1nc2n(CC)nc(C)c2c(=O)[nH]1)-c1csc(n1)-c1ccccc1
: