Target
C-C chemokine receptor type 4
Ligand
BDBM50500905
Substrate
Meas. Tech.
ChEMBL_1572951 (CHEMBL3801461)
Ki
100±n/a nM
Citation
 Shukla, LAjram, LABegg, MEvans, BGraves, RHHodgson, STLynn, SMMiah, AHPercy, JMProcopiou, PARichards, SASlack, RJ 2,8-Diazaspiro[4.5]decan-8-yl)pyrimidin-4-amine potent CCR4 antagonists capable of inducing receptor endocytosis. Eur J Med Chem 115:14-25 (2016)  
Target
Name:
C-C chemokine receptor type 4
Synonyms:
C-C CKR-4 C-C chemokine receptor type 4 (CCR4) CCR-4 CCR4_HUMAN CMKBR4 | K5-5
Type:
Enzyme
Mol. Mass.:
41406.41
Organism:
Homo sapiens (Human)
Description:
P51679
Residue:
360
  
Inhibitor
Name:
BDBM50500905
Synonyms:
CHEMBL3798539
Type:
Small organic molecule
Emp. Form.:
C25H26Cl2N6O
Mol. Mass.:
497.42
SMILES:
Clc1ccc(CNc2ccnc(n2)N2CCC3(CCN(C3)C(=O)c3ccccn3)CC2)c(Cl)c1
: