Target
Adenosine receptor A1
Ligand
BDBM50051241
Substrate
Meas. Tech.
ChEMBL_29479 (CHEMBL640472)
Ki
504±n/a nM
Citation
 Baraldi, PGCacciari, BSpalluto, GPineda de las Infantas y Villatoro, MJZocchi, CDionisotti, SOngini, E Pyrazolo[4,3-e]-1,2,4-triazolo[1,5-c]pyrimidine derivatives: potent and selective A(2A) adenosine antagonists. J Med Chem 39:1164-71 (1996)  
Target
Name:
Adenosine receptor A1
Synonyms:
AA1R_RAT ADENOSINE A1 high Adenosine A1 receptor (A1) Adenosine receptors A1 | Adora1
Type:
Protein
Mol. Mass.:
36704.13
Organism:
Rattus norvegicus (rat)
Description:
Residue:
326
  
Inhibitor
Name:
BDBM50051241
Synonyms:
2-(furan-2-yl)-7-(3-phenylpropyl)-7H-pyrazolo[4,3-e][1,2,4]triazolo[1,5-c]pyrimidin-5-amine 2-Furan-2-yl-7-(3-phenyl-propyl)-7H-pyrazolo[4,3-e][1,2,4]triazolo[1,5-c]pyrimidin-5-ylamine(SCH 63390) SCH-63390
Type:
Small organic molecule
Emp. Form.:
C19H17N7O
Mol. Mass.:
359.3846
SMILES:
Nc1nc2n(CCCc3ccccc3)ncc2c2nc(nn12)-c1ccco1
: