Target
Reverse transcriptase
Ligand
BDBM50103642
Substrate
Meas. Tech.
ChEMBL_1575430 (CHEMBL3802512)
IC50
10.0±n/a nM
Citation
 Geisman, ANValuev-Elliston, VTOzerov, AAKhandazhinskaya, ALChizhov, AOKochetkov, SNPannecouque, CNaesens, LSeley-Radtke, KLNovikov, MS 1,6-Bis[(benzyloxy)methyl]uracil derivatives-Novel antivirals with activity against HIV-1 and influenza H1N1 virus. Bioorg Med Chem 24:2476-85 (2016)  
Target
Name:
Reverse transcriptase
Synonyms:
Type:
Protein
Mol. Mass.:
29598.37
Organism:
Human immunodeficiency virus 1
Description:
Q9WKE8
Residue:
254
  
Inhibitor
Name:
BDBM50103642
Synonyms:
4-(6-amino-5-bromo-2-(4-cyanophenylamino)pyrimidin-4-ylamino)-3,5-dimethylbenzonitrile 4-({6-AMINO-5-BROMO-2-[(4-CYANOPHENYL)AMINO]PYRIMIDIN-4-YL}OXY)-3,5-DIMETHYLBENZONITRILE CHEMBL308954 Etravirine (ETR) Etravirine (TMC125) TMC-125
Type:
Small organic molecule
Emp. Form.:
C20H15BrN6O
Mol. Mass.:
435.277
SMILES:
Cc1cc(cc(C)c1Oc1nc(Nc2ccc(cc2)C#N)nc(N)c1Br)C#N
: