Target
60 kDa heat shock protein, mitochondrial
Ligand
BDBM50495801
Substrate
Meas. Tech.
ChEMBL_1578875 (CHEMBL3813273)
IC50
>250000±n/a nM
Citation
 Abdeen, SSalim, NMammadova, NSummers, CMFrankson, RAmbrose, AJAnderson, GGSchultz, PGHorwich, ALChapman, EJohnson, SM GroEL/ES inhibitors as potential antibiotics. Bioorg Med Chem Lett 26:3127-3134 (2016)  
Target
Name:
60 kDa heat shock protein, mitochondrial
Synonyms:
3.6.4.9 60 kDa heat shock protein, mitochondrial CPN60 HSP-60 HSP60/HSP10 Heat shock protein 60 Mitochondrial matrix protein P1 | P60 lymphocyte protein
Type:
PROTEIN
Mol. Mass.:
61050.41
Organism:
Homo sapiens
Description:
ChEMBL_117701
Residue:
573
  
Inhibitor
Name:
BDBM50495801
Synonyms:
CHEMBL3115911
Type:
Small organic molecule
Emp. Form.:
C16H11NO4S2
Mol. Mass.:
345.393
SMILES:
Oc1ccc(cc1)N1C(=S)S\C(=C/c2ccc(O)c(O)c2)C1=O
: