Target
Xanthine dehydrogenase/oxidase
Ligand
BDBM50051727
Substrate
Meas. Tech.
ChEMBL_217078 (CHEMBL823474)
IC50
2850±n/a nM
Citation
 Biagi, GCostantini, ACostantino, LGiorgi, ILivi, OPecorari, PRinaldi, MScartoni, V Synthesis and biological evaluation of new imidazole, pyrimidine, and purine derivatives and analogs as inhibitors of xanthine oxidase. J Med Chem 39:2529-35 (1996)  
Target
Name:
Xanthine dehydrogenase/oxidase
Synonyms:
XD XDHA XO Xanthine dehydrogenase/oxidase | Xanthine oxidase
Type:
Enzyme
Mol. Mass.:
146441.21
Organism:
Homo sapiens (Human)
Description:
P47989
Residue:
1333
  
Inhibitor
Name:
BDBM50051727
Synonyms:
2-Pentylsulfanyl-1,9-dihydro-purin-6-one | CHEMBL86021
Type:
Small organic molecule
Emp. Form.:
C10H14N4OS
Mol. Mass.:
238.309
SMILES:
CCCCCSc1nc2nc[nH]c2c(=O)[nH]1
: