Target
Xanthine dehydrogenase/oxidase
Ligand
BDBM50051736
Substrate
Meas. Tech.
ChEMBL_217080 (CHEMBL823476)
Ki
>100000±n/a nM
Citation
 Biagi, GCostantini, ACostantino, LGiorgi, ILivi, OPecorari, PRinaldi, MScartoni, V Synthesis and biological evaluation of new imidazole, pyrimidine, and purine derivatives and analogs as inhibitors of xanthine oxidase. J Med Chem 39:2529-35 (1996)  
Target
Name:
Xanthine dehydrogenase/oxidase
Synonyms:
XD XDHA XO Xanthine dehydrogenase/oxidase | Xanthine oxidase
Type:
Enzyme
Mol. Mass.:
146441.21
Organism:
Homo sapiens (Human)
Description:
P47989
Residue:
1333
  
Inhibitor
Name:
BDBM50051736
Synonyms:
7,8-Dihydro-3H,6H-9-thia-1,2,3,4,5a-pentaaza-cyclopenta[a]naphthalen-5-one | CHEMBL315969
Type:
Small organic molecule
Emp. Form.:
C7H7N5OS
Mol. Mass.:
209.228
SMILES:
O=c1[nH]c2nnnc2c2SCCCn12
: