Target
60 kDa heat shock protein, mitochondrial
Ligand
BDBM50450013
Substrate
Meas. Tech.
ChEMBL_1617698 (CHEMBL3859767)
IC50
65000±n/a nM
Citation
 Abdeen, SSalim, NMammadova, NSummers, CMGoldsmith-Pestana, KMcMahon-Pratt, DSchultz, PGHorwich, ALChapman, EJohnson, SM Targeting the HSP60/10 chaperonin systems of Trypanosoma brucei as a strategy for treating African sleeping sickness. Bioorg Med Chem Lett 26:5247-5253 (2016)  
Target
Name:
60 kDa heat shock protein, mitochondrial
Synonyms:
3.6.4.9 60 kDa heat shock protein, mitochondrial CPN60 HSP-60 HSP60/HSP10 Heat shock protein 60 Mitochondrial matrix protein P1 | P60 lymphocyte protein
Type:
PROTEIN
Mol. Mass.:
61050.41
Organism:
Homo sapiens
Description:
ChEMBL_117701
Residue:
573
  
Inhibitor
Name:
BDBM50450013
Synonyms:
CHEMBL3955935
Type:
Small organic molecule
Emp. Form.:
C25H17N5O9S2
Mol. Mass.:
595.561
SMILES:
[O-][N+](=O)c1ccc(cc1)S(=O)(=O)Nc1ccc(cc1)-c1nc2cc(NS(=O)(=O)c3ccc(cc3)[N+]([O-])=O)ccc2o1
: