Target
Protein farnesyltransferase subunit beta/geranylgeranyltransferase type-1 subunit alpha
Ligand
BDBM50051826
Substrate
Meas. Tech.
ChEMBL_163505 (CHEMBL772416)
IC50
500±n/a nM
Citation
 Williams, TMCiccarone, TMMacTough, SCBock, RLConner, MWDavide, JPHamilton, KKoblan, KSKohl, NEKral, AMMosser, SDOmer, CAPompliano, DLRands, ESchaber, MDShah, DWilson, FRGibbs, JBGraham, SLHartman, GDOliff, AISmith, RL 2-substituted piperazines as constrained amino acids. Application to the synthesis of potent, non carboxylic acid inhibitors of farnesyltransferase. J Med Chem 39:1345-8 (1996)  
Target
Name:
Protein farnesyltransferase subunit beta/geranylgeranyltransferase type-1 subunit alpha
Synonyms:
Protein Farnesyltransferase (PFT)/farnesyltransferase beta subunit | Protein farnesyltransferase
Type:
Mol. Mass.:
Description:
ASSAY_ID of EBI is 69815
Components:
This complex has 2 components.
Component 1
Name:
Protein farnesyltransferase subunit beta
Synonyms:
CAAX farnesyltransferase subunit beta FTase-beta Protein farnesyltransferase Ras proteins prenyltransferase subunit beta
Type:
PROTEIN
Mol. Mass.:
48666.41
Organism:
Rattus norvegicus
Description:
EBI_10573
Residue:
437
  
Component 2
Name:
Protein farnesyltransferase/geranylgeranyltransferase type-1 subunit alpha
Synonyms:
CAAX farnesyltransferase alpha subunit FTase-alpha GGTase-I-alpha Protein farnesyltransferase/geranylgeranyltransferase type I alpha subunit Type I protein geranyl-geranyltransferase alpha subunit | geranylgeranyltransferase type-I
Type:
Enzyme
Mol. Mass.:
44030.14
Organism:
Rattus norvegicus (rat)
Description:
Recombinant rat enzyme.
Residue:
377
  
Inhibitor
Name:
BDBM50051826
Synonyms:
CHEMBL27486 [4-((R)-2-Amino-3-mercapto-propyl)-3-butyl-piperazin-1-yl]-naphthalen-1-yl-methanone
Type:
Small organic molecule
Emp. Form.:
C22H31N3OS
Mol. Mass.:
385.566
SMILES:
CCCC[C@H]1CN(CCN1C[C@@H](N)CS)C(=O)c1cccc2ccccc12
: