Target
Squalene synthase
Ligand
BDBM50051874
Substrate
Meas. Tech.
ChEMBL_202107 (CHEMBL814216)
IC50
10±n/a nM
Citation
 Procopiou, PACox, BKirk, BELester, MGMcCarthy, ADSareen, MSharratt, PJSnowden, MASpooner, SJWatson, NSWiddowson, J The squalestatins: inhibitors of squalene synthase. Enzyme inhibitory activities and in vivo evaluation of C3-modified analogues. J Med Chem 39:1413-22 (1996)  
Target
Name:
Squalene synthase
Synonyms:
FDFT_RAT Farnesyl-diphosphate farnesyltransferase SQS Squalene synthetase
Type:
PROTEIN
Mol. Mass.:
48109.41
Organism:
Rattus norvegicus
Description:
ChEMBL_1336736
Residue:
416
  
Inhibitor
Name:
BDBM50051874
Synonyms:
(1S,3R,4S,5R,6R,7R)-1-((4S,5R)-4-Acetoxy-5-methyl-3-methylene-6-phenyl-hexyl)-3-dimethylaminomethyl-6-((E)-(4S,6S)-4,6-dimethyl-oct-2-enoyloxy)-4,7-dihydroxy-2,8-dioxa-bicyclo[3.2.1]octane-4,5-dicarboxylic acid | CHEMBL285360
Type:
Small organic molecule
Emp. Form.:
C37H53NO12
Mol. Mass.:
703.8162
SMILES:
CC[C@H](C)C[C@H](C)\C=C\C(=O)O[C@@H]1[C@@H](O)[C@]2(CCC(=C)[C@@H](OC(C)=O)[C@H](C)Cc3ccccc3)O[C@@]1(C(O)=O)[C@@](O)([C@@H](CN(C)C)O2)C(O)=O
: