Target
Histone-lysine N-methyltransferase EHMT1
Ligand
BDBM50501525
Substrate
Meas. Tech.
ChEMBL_1656197 (CHEMBL4005667)
Kd
46±n/a nM
Citation
 Xiong, YLi, FBabault, NDong, AZeng, HWu, HChen, XArrowsmith, CHBrown, PJLiu, JVedadi, MJin, J Discovery of Potent and Selective Inhibitors for G9a-Like Protein (GLP) Lysine Methyltransferase. J Med Chem 60:1876-1891 (2017)  
Target
Name:
Histone-lysine N-methyltransferase EHMT1
Synonyms:
EHMT1 EUHMTASE1 Euchromatic histone-lysine N-methyltransferase 1 GLP H3-K9-HMTase 5 Histone-lysine N-methyltransferase EHMT1/EHMT2 KMT1D | Lysine N-methyltransferase 1D
Type:
PROTEIN
Mol. Mass.:
141443.67
Organism:
Homo sapiens (Human)
Description:
ChEMBL_1450367
Residue:
1298
  
Inhibitor
Name:
BDBM50501525
Synonyms:
CHEMBL4086403
Type:
Small organic molecule
Emp. Form.:
C22H35N5O2
Mol. Mass.:
401.5456
SMILES:
CCCCCCNc1nc(NC2CCN(C)CC2)c2cc(OC)c(OC)cc2n1
: