Target
Tyrosine-protein kinase JAK1
Ligand
BDBM209866
Substrate
Meas. Tech.
ChEMBL_1656248 (CHEMBL4005718)
IC50
>10000±n/a nM
Citation
 Thorarensen, ADowty, MEBanker, MEJuba, BJussif, JLin, TVincent, FCzerwinski, RMCasimiro-Garcia, AUnwalla, RTrujillo, JILiang, SBalbo, PChe, YGilbert, AMBrown, MFHayward, MMontgomery, JLeung, LYang, XSoucy, SHegen, MCoe, JLangille, JVajdos, FChrencik, JTelliez, JB Design of a Janus Kinase 3 (JAK3) Specific Inhibitor 1-((2S,5R)-5-((7H-Pyrrolo[2,3-d]pyrimidin-4-yl)amino)-2-methylpiperidin-1-yl)prop-2-en-1-one (PF-06651600) Allowing for the Interrogation of JAK3 Signaling in Humans. J Med Chem 60:1971-1993 (2017)  
Target
Name:
Tyrosine-protein kinase JAK1
Synonyms:
JAK-1 JAK1A JAK1_HUMAN Janus kinase 1 (JAK1) | Janus kinase 1 JAK1
Type:
Protein
Mol. Mass.:
133293.73
Organism:
Homo sapiens (Human)
Description:
P23458
Residue:
1154
  
Inhibitor
Name:
BDBM209866
Synonyms:
PF-06651600 US20230348487, Example PF-06651600 | US9617258, Example 5
Type:
Small organic molecule
Emp. Form.:
C15H19N5O
Mol. Mass.:
285.3443
SMILES:
C[C@H]1CC[C@H](CN1C(=O)C=C)Nc1ncnc2[nH]ccc12
: