Target
Glutathione reductase, mitochondrial
Ligand
BDBM50052002
Substrate
Meas. Tech.
ChEMBL_72475 (CHEMBL685508)
IC50
8000±n/a nM
Citation
 Schönleben-Janas, AKirsch, PMittl, PRSchirmer, RHKrauth-Siegel, RL Inhibition of human glutathione reductase by 10-arylisoalloxazines: crystalline, kinetic, and electrochemical studies. J Med Chem 39:1549-54 (1996)  
Target
Name:
Glutathione reductase, mitochondrial
Synonyms:
GLUR GSHR_HUMAN Glutathione reductase | Glutathione reductase (GR)
Type:
Enzyme
Mol. Mass.:
56271.52
Organism:
Homo sapiens (Human)
Description:
P00390
Residue:
522
  
Inhibitor
Name:
BDBM50052002
Synonyms:
3-Methyl-10-pyridin-3-yl-10H-benzo[g]pteridine-2,4-dione | CHEMBL39829
Type:
Small organic molecule
Emp. Form.:
C16H11N5O2
Mol. Mass.:
305.2908
SMILES:
Cn1c(=O)nc2n(-c3cccnc3)c3ccccc3nc2c1=O
: