Target
Glutathione reductase, mitochondrial
Ligand
BDBM50052006
Substrate
Meas. Tech.
ChEMBL_72475 (CHEMBL685508)
IC50
3500±n/a nM
Citation
 Schönleben-Janas, AKirsch, PMittl, PRSchirmer, RHKrauth-Siegel, RL Inhibition of human glutathione reductase by 10-arylisoalloxazines: crystalline, kinetic, and electrochemical studies. J Med Chem 39:1549-54 (1996)  
Target
Name:
Glutathione reductase, mitochondrial
Synonyms:
GLUR GSHR_HUMAN Glutathione reductase | Glutathione reductase (GR)
Type:
Enzyme
Mol. Mass.:
56271.52
Organism:
Homo sapiens (Human)
Description:
P00390
Residue:
522
  
Inhibitor
Name:
BDBM50052006
Synonyms:
10-Pentafluorophenyl-10H-benzo[g]pteridine-2,4-dione | CHEMBL290422
Type:
Small organic molecule
Emp. Form.:
C16H5F5N4O2
Mol. Mass.:
380.2285
SMILES:
Fc1c(F)c(F)c(c(F)c1F)-n1c2ccccc2nc2c1nc(=O)[nH]c2=O
: