Target
Glutathione reductase, mitochondrial
Ligand
BDBM50052011
Substrate
Meas. Tech.
ChEMBL_72475 (CHEMBL685508)
IC50
8000±n/a nM
Citation
 Schönleben-Janas, AKirsch, PMittl, PRSchirmer, RHKrauth-Siegel, RL Inhibition of human glutathione reductase by 10-arylisoalloxazines: crystalline, kinetic, and electrochemical studies. J Med Chem 39:1549-54 (1996)  
Target
Name:
Glutathione reductase, mitochondrial
Synonyms:
GLUR GSHR_HUMAN Glutathione reductase | Glutathione reductase (GR)
Type:
Enzyme
Mol. Mass.:
56271.52
Organism:
Homo sapiens (Human)
Description:
P00390
Residue:
522
  
Inhibitor
Name:
BDBM50052011
Synonyms:
CHEMBL38563 | [2,4-Dioxo-10-(3-trifluoromethyl-phenyl)-4,10-dihydro-2H-benzo[g]pteridin-3-yl]-acetic acid ethyl ester
Type:
Small organic molecule
Emp. Form.:
C21H15F3N4O4
Mol. Mass.:
444.3634
SMILES:
CCOC(=O)Cn1c(=O)nc2n(-c3cccc(c3)C(F)(F)F)c3ccccc3nc2c1=O
: