Target
Beta-galactoside alpha-2,6-sialyltransferase 1
Ligand
BDBM50501639
Substrate
Meas. Tech.
ChEMBL_1656606 (CHEMBL4006076)
Ki
224±n/a nM
Citation
 Guo, JLi, WXue, WYe, XS Transition State-Based Sialyltransferase Inhibitors: Mimicking Oxocarbenium Ion by Simple Amide. J Med Chem 60:2135-2141 (2017)  
Target
Name:
Beta-galactoside alpha-2,6-sialyltransferase 1
Synonyms:
Alpha 2,6-ST 1 Beta-galactoside alpha-2,6-sialyltransferase 1 SIAT1 ST6GAL1 ST6GalI | Sialyltransferase 1
Type:
PROTEIN
Mol. Mass.:
46622.19
Organism:
Homo sapiens (Human)
Description:
ChEMBL_109837
Residue:
406
  
Inhibitor
Name:
BDBM50501639
Synonyms:
CHEMBL4083608
Type:
Small organic molecule
Emp. Form.:
C15H19N4Na3O13P2
Mol. Mass.:
594.2472
SMILES:
[Na;v0+].[Na;v0+].[Na;v0+].[#7]-c1ccn(-[#6@@H]-2-[#8]-[#6@H](-[#6]-[#8]P([#8-])(=O)[#8]-[#6](-[#6]-[#7]-3-[#6](=O)-[#6]-[#6]-[#6]-3=O)P([#8-])([#8-])=O)-[#6@@H](-[#8])-[#6@H]-2-[#8])c(=O)n1
: