Target
Beta-galactoside alpha-2,6-sialyltransferase 1
Ligand
BDBM50501642
Substrate
Meas. Tech.
ChEMBL_1656606 (CHEMBL4006076)
Ki
29±n/a nM
Citation
 Guo, JLi, WXue, WYe, XS Transition State-Based Sialyltransferase Inhibitors: Mimicking Oxocarbenium Ion by Simple Amide. J Med Chem 60:2135-2141 (2017)  
Target
Name:
Beta-galactoside alpha-2,6-sialyltransferase 1
Synonyms:
Alpha 2,6-ST 1 Beta-galactoside alpha-2,6-sialyltransferase 1 SIAT1 ST6GAL1 ST6GalI | Sialyltransferase 1
Type:
PROTEIN
Mol. Mass.:
46622.19
Organism:
Homo sapiens (Human)
Description:
ChEMBL_109837
Residue:
406
  
Inhibitor
Name:
BDBM50501642
Synonyms:
CHEMBL3629698
Type:
Small organic molecule
Emp. Form.:
C23H27N4Na3O15P2
Mol. Mass.:
730.3951
SMILES:
[Na;v0+].[Na;v0+].[Na;v0+].[#6]-[#6](=O)-[#7]-[#6@@H]-1-[#6@@H](-[#8])-[#6]=[#6](-[#8]-[#6@H]-1-[#8]-c1ccccc1)-[#6](-[#8]P([#8-])(=O)[#8]-[#6]-[#6@H]-1-[#8]-[#6@H](-[#6@H](-[#8])-[#6@@H]-1-[#8])-n1ccc(-[#7])nc1=O)P([#8-])([#8-])=O
: