Target
D(2) dopamine receptor
Ligand
BDBM50052195
Substrate
Meas. Tech.
ChEMBL_62247 (CHEMBL671579)
Ki
32±n/a nM
Citation
 Ohmori, JMaeno, KHidaka, KNakato, KMatsumoto, MTada, SHattori, HSakamoto, STsukamoto, SUsuda, SMase, T Dopamine D3 and D4 receptor antagonists: synthesis and structure--activity relationships of (S)-(+)-N-(1-Benzyl-3-pyrrolidinyl)-5-chloro-4- [(cyclopropylcarbonyl) amino]-2-methoxybenzamide (YM-43611) and related compounds. J Med Chem 39:2764-72 (1996)  
Target
Name:
D(2) dopamine receptor
Synonyms:
DOPAMINE D2 DOPAMINE D2 Short Dopamine D2 receptor Drd2
Type:
G Protein-Coupled Receptor (GPCR)
Mol. Mass.:
50931.60
Organism:
Rattus norvegicus (rat)
Description:
P61169
Residue:
444
  
Inhibitor
Name:
BDBM50052195
Synonyms:
CHEMBL93198 | N-((S)-1-Benzyl-pyrrolidin-3-yl)-5-chloro-2-methoxy-4-propionylamino-benzamide
Type:
Small organic molecule
Emp. Form.:
C22H26ClN3O3
Mol. Mass.:
415.913
SMILES:
CCC(=O)Nc1cc(OC)c(cc1Cl)C(=O)N[C@H]1CCN(Cc2ccccc2)C1
: