Target
Nuclear receptor ROR-alpha
Ligand
BDBM50502387
Substrate
Meas. Tech.
ChEMBL_1807488 (CHEMBL4306847)
IC50
1995±n/a nM
Citation
 von Berg, SXue, YCollins, MLlinas, AOlsson, RIHalvarsson, TLindskog, MMalmberg, JJirholt, JKrutrök, NRamnegård, MBrännström, MLundqvist, ALepistö, MAagaard, AMcPheat, JHansson, ELChen, RXiong, YHansson, TGNarjes, F Discovery of Potent and Orally Bioavailable Inverse Agonists of the Retinoic Acid Receptor-Related Orphan Receptor C2. ACS Med Chem Lett 10:972-977 (2019)  
Target
Name:
Nuclear receptor ROR-alpha
Synonyms:
NR1F1 Nuclear receptor subfamily 1 group F member 1 RORA RZRA | Retinoid-related orphan receptor-alpha
Type:
PROTEIN
Mol. Mass.:
58976.26
Organism:
Homo sapiens (Human)
Description:
ChEMBL_101591
Residue:
523
  
Inhibitor
Name:
BDBM50502387
Synonyms:
CHEMBL4458320
Type:
Small organic molecule
Emp. Form.:
C27H24F6N2O5S
Mol. Mass.:
602.545
SMILES:
CCS(=O)(=O)c1ccc(cc1)C(NC(=O)Cc1ccccc1)C(=O)Nc1ccc(cc1)C(O)(C(F)(F)F)C(F)(F)F
: