Target
Histone-lysine N-methyltransferase SMYD3
Ligand
BDBM50502434
Substrate
Meas. Tech.
ChEMBL_1807511 (CHEMBL4306870)
Ki
3900±n/a nM
Citation
 Huang, CLiew, SSLin, GRPoulsen, AAng, MJYChia, BCSChew, SYKwek, ZPWee, JLKOng, EHRetna, PBaburajendran, NLi, RYu, WKoh-Stenta, XNgo, AManesh, SFulwood, JKe, ZChung, HHSepramaniam, SChew, XHDinie, NLee, MAChew, YSLow, CBPendharkar, VManoharan, VVuddagiri, SSangthongpitag, KJoy, JMatter, AHill, JKeller, THFoo, K Discovery of Irreversible Inhibitors Targeting Histone Methyltransferase, SMYD3. ACS Med Chem Lett 10:978-984 (2019)  
Target
Name:
Histone-lysine N-methyltransferase SMYD3
Synonyms:
SET and MYND domain-containing protein 3 SMYD3_HUMAN ZNFN3A1 | Zinc finger MYND domain-containing protein 1
Type:
Enzyme
Mol. Mass.:
49101.22
Organism:
Homo sapiens (Human)
Description:
Q9H7B4-2
Residue:
428
  
Inhibitor
Name:
BDBM50502434
Synonyms:
CHEMBL4551647
Type:
Small organic molecule
Emp. Form.:
C24H24ClN3O3
Mol. Mass.:
437.919
SMILES:
CCCOC(=O)N1CCN(CC1)C(=O)c1ccc2c(Cl)cc(nc2c1)-c1ccccc1
: