Target
Nicotinamide N-methyltransferase
Ligand
BDBM50502439
Substrate
Meas. Tech.
ChEMBL_1807616 (CHEMBL4306975)
Kd
36000±n/a nM
Citation
 Gao, Yvan Haren, MJMoret, EERood, JJMSartini, DSalvucci, AEmanuelli, MCraveur, PBabault, NJin, JMartin, NI Bisubstrate Inhibitors of Nicotinamide  J Med Chem 62:6597-6614 (2019)  
Target
Name:
Nicotinamide N-methyltransferase
Synonyms:
NNMT Nicotinamide N-methyltransferase | Nicotinamide N-methyltransferase (NNMT)
Type:
Protein
Mol. Mass.:
29571.16
Organism:
Homo sapiens (Human)
Description:
Residue:
264
  
Inhibitor
Name:
BDBM50502439
Synonyms:
CHEMBL4520769
Type:
Small organic molecule
Emp. Form.:
C22H28N8O6
Mol. Mass.:
500.5077
SMILES:
N[C@@H](CCN(C[C@H]1O[C@H]([C@H](O)[C@@H]1O)n1cnc2c(N)ncnc12)Cc1cccc(c1)C(N)=O)C(O)=O
: