Target
Potassium voltage-gated channel subfamily H member 1
Ligand
BDBM50502598
Substrate
Meas. Tech.
ChEMBL_1808111 (CHEMBL4307470)
IC50
1780±n/a nM
Citation
 Oehlrich, DPeschiulli, ATresadern, GVan Gool, MVega, JADe Lucas, AIAlonso de Diego, SAProkopcova, HAustin, NVan Brandt, SSurkyn, MDe Cleyn, MVos, ARombouts, FJRMacdonald, GMoechars, DGijsen, HJMTrabanco, AA Evaluation of a Series of ?-Secretase 1 Inhibitors Containing Novel Heteroaryl-Fused-Piperazine Amidine Warheads. ACS Med Chem Lett 10:1159-1165 (2019)  
Target
Name:
Potassium voltage-gated channel subfamily H member 1
Synonyms:
EAG EAG1 KCNH1 Potassium voltage-gated channel subfamily H member 1 Voltage-gated potassium channel subunit Kv10.1 hEAG1
Type:
PROTEIN
Mol. Mass.:
111433.08
Organism:
Homo sapiens
Description:
ChEMBL_105708
Residue:
989
  
Inhibitor
Name:
BDBM50502598
Synonyms:
CHEMBL4521954
Type:
Small organic molecule
Emp. Form.:
C20H17N7O
Mol. Mass.:
371.3953
SMILES:
C[C@]1(Cn2nccc2C(N)=N1)c1cccc(NC(=O)c2ccc(cn2)C#N)c1
: