Target
Potassium voltage-gated channel subfamily H member 1
Ligand
BDBM50502601
Substrate
Meas. Tech.
ChEMBL_1808111 (CHEMBL4307470)
IC50
4170±n/a nM
Citation
 Oehlrich, DPeschiulli, ATresadern, GVan Gool, MVega, JADe Lucas, AIAlonso de Diego, SAProkopcova, HAustin, NVan Brandt, SSurkyn, MDe Cleyn, MVos, ARombouts, FJRMacdonald, GMoechars, DGijsen, HJMTrabanco, AA Evaluation of a Series of ?-Secretase 1 Inhibitors Containing Novel Heteroaryl-Fused-Piperazine Amidine Warheads. ACS Med Chem Lett 10:1159-1165 (2019)  
Target
Name:
Potassium voltage-gated channel subfamily H member 1
Synonyms:
EAG EAG1 KCNH1 Potassium voltage-gated channel subfamily H member 1 Voltage-gated potassium channel subunit Kv10.1 hEAG1
Type:
PROTEIN
Mol. Mass.:
111433.08
Organism:
Homo sapiens
Description:
ChEMBL_105708
Residue:
989
  
Inhibitor
Name:
BDBM50502601
Synonyms:
CHEMBL4525199
Type:
Small organic molecule
Emp. Form.:
C20H16FN7O
Mol. Mass.:
389.3857
SMILES:
C[C@]1(Cn2ccnc2C(N)=N1)c1cc(NC(=O)c2ccc(cn2)C#N)ccc1F
: