Target
Serine/threonine-protein kinase ULK1
Ligand
BDBM50111572
Substrate
Meas. Tech.
ChEMBL_1809522 (CHEMBL4308982)
IC50
45±n/a nM
Citation
 He, SLi, QJiang, XLu, XFeng, FQu, WChen, YSun, H Design of Small Molecule Autophagy Modulators: A Promising Druggable Strategy. J Med Chem 61:4656-4687 (2018)  
Target
Name:
Serine/threonine-protein kinase ULK1
Synonyms:
ATG1 KIAA0722 ULK1_HUMAN hATG1
Type:
PROTEIN
Mol. Mass.:
112661.80
Organism:
Homo sapiens (Human)
Description:
ChEMBL_1510275
Residue:
1050
  
Inhibitor
Name:
BDBM50111572
Synonyms:
CHEMBL3605057
Type:
Small organic molecule
Emp. Form.:
C26H36N6O2
Mol. Mass.:
464.603
SMILES:
O=C(NCCCNc1nc(Nc2cccc(CN3CCOCC3)c2)ncc1C1CC1)C1CCC1
: