Target
Serine/threonine-protein kinase ULK1
Ligand
BDBM50503137
Substrate
Meas. Tech.
ChEMBL_1809522 (CHEMBL4308982)
IC50
2.9±n/a nM
Citation
 He, SLi, QJiang, XLu, XFeng, FQu, WChen, YSun, H Design of Small Molecule Autophagy Modulators: A Promising Druggable Strategy. J Med Chem 61:4656-4687 (2018)  
Target
Name:
Serine/threonine-protein kinase ULK1
Synonyms:
ATG1 KIAA0722 ULK1_HUMAN hATG1
Type:
PROTEIN
Mol. Mass.:
112661.80
Organism:
Homo sapiens (Human)
Description:
ChEMBL_1510275
Residue:
1050
  
Inhibitor
Name:
BDBM50503137
Synonyms:
CHEMBL4516990
Type:
Small organic molecule
Emp. Form.:
C25H34N6O
Mol. Mass.:
434.5771
SMILES:
CN1CCc2cc(Nc3ncc(C4CC4)c(NCCCNC(=O)C4CCC4)n3)ccc2C1
: