Target
Glutamate receptor ionotropic, NMDA 2C
Ligand
BDBM50503144
Substrate
Meas. Tech.
ChEMBL_1809546 (CHEMBL4309006)
IC50
112000±n/a nM
Citation
 Burnell, ESIrvine, MFang, GSapkota, KJane, DEMonaghan, DT Positive and Negative Allosteric Modulators of N-Methyl-d-aspartate (NMDA) Receptors: Structure-Activity Relationships and Mechanisms of Action. J Med Chem 62:3-23 (2019)  
Target
Name:
Glutamate receptor ionotropic, NMDA 2C
Synonyms:
GRIN2C Ionotropic glutamate receptor NMDA 1/2C NMDE3_HUMAN
Type:
PROTEIN
Mol. Mass.:
134240.15
Organism:
Homo sapiens (Human)
Description:
ChEMBL_143328
Residue:
1233
  
Inhibitor
Name:
BDBM50503144
Synonyms:
CHEBI:35420 | CHEMBL1179605
Type:
Small organic molecule
Emp. Form.:
C21H32O5S
Mol. Mass.:
396.541
SMILES:
[H][C@@]12CC[C@H](C(C)=O)[C@@]1(C)CC[C@@]1([H])[C@@]2([H])CC=C2C[C@H](CC[C@]12C)OS(O)(=O)=O
: