Target
Proton-coupled folate transporter
Ligand
BDBM50503237
Substrate
Meas. Tech.
ChEMBL_1809834 (CHEMBL4309294)
Ki
170±n/a nM
Citation
 Ravindra, MWilson, MRTong, NO'Connor, CKarim, MPolin, LWallace-Povirk, AWhite, KKushner, JHou, ZMatherly, LHGangjee, A Fluorine-Substituted Pyrrolo[2,3- d]Pyrimidine Analogues with Tumor Targeting via Cellular Uptake by Folate Receptor ? and the Proton-Coupled Folate Transporter and Inhibition of de Novo Purine Nucleotide Biosynthesis. J Med Chem 61:4228-4248 (2018)  
Target
Name:
Proton-coupled folate transporter
Synonyms:
G21 Heme carrier protein 1 PCFT/HCP1 SLC46A1 | Solute carrier family 46 member 1
Type:
PROTEIN
Mol. Mass.:
49782.13
Organism:
Homo sapiens (Human)
Description:
ChEMBL_1469597
Residue:
459
  
Inhibitor
Name:
BDBM50503237
Synonyms:
CHEMBL4540298
Type:
Small organic molecule
Emp. Form.:
C22H24FN5O6
Mol. Mass.:
473.4543
SMILES:
Nc1nc2[nH]c(CCCCc3ccc(C(=O)N[C@@H](CCC(O)=O)C(O)=O)c(F)c3)cc2c(=O)[nH]1
: