Target
C-X-C chemokine receptor type 2
Ligand
BDBM50503347
Substrate
Meas. Tech.
ChEMBL_1810483 (CHEMBL4309943)
IC50
0.100000±n/a nM
Citation
 Wold, EAChen, JCunningham, KAZhou, J Allosteric Modulation of Class A GPCRs: Targets, Agents, and Emerging Concepts. J Med Chem 62:88-127 (2019)  
Target
Name:
C-X-C chemokine receptor type 2
Synonyms:
C-X-C chemokine receptor type 2 (CXCR-2) CD_antigen=CD182 CXCR-2 CXCR2_HUMAN GRO/MGSA receptor IL-8 receptor type 2 IL8RB | Interleukin-8 receptor B
Type:
Protein
Mol. Mass.:
40767.88
Organism:
Homo sapiens (Human)
Description:
P25025
Residue:
360
  
Inhibitor
Name:
BDBM50503347
Synonyms:
CHEMBL4442431
Type:
Small organic molecule
Emp. Form.:
C11H11F3NNaO6S2
Mol. Mass.:
397.323
SMILES:
[Na;v0+].[#6]-[#6@@H](-[#6](=O)-[#7-]S([#6])(=O)=O)-c1ccc(-[#8]S(=O)(=O)C(F)(F)F)cc1
: