Target
Mu-type opioid receptor
Ligand
BDBM102406
Substrate
Meas. Tech.
ChEMBL_1811154 (CHEMBL4310614)
Ki
1.6±n/a nM
Citation
 Inagaki, MKume, MTamura, YHara, SGoto, YHaga, NHasegawa, TNakamura, TKoike, KOonishi, SKanemasa, TKai, H Discovery of naldemedine: A potent and orally available opioid receptor antagonist for treatment of opioid-induced adverse effects. Bioorg Med Chem Lett 29:73-77 (2019)  
Target
Name:
Mu-type opioid receptor
Synonyms:
M-OR-1 MOR-1 MUOR1 Mu opiate receptor OPRM1 hMOP | mu-type opioid receptor isoform MOR-1
Type:
G Protein-Coupled Receptor (GPCR)
Mol. Mass.:
44789.51
Organism:
Homo sapiens (Human)
Description:
P35372
Residue:
400
  
Inhibitor
Name:
BDBM102406
Synonyms:
US8536192, I-135
Type:
Small organic molecule
Emp. Form.:
C26H30N2O7
Mol. Mass.:
482.5256
SMILES:
COC(=O)C1(CC1)NC(=O)C1=C(O)[C@@H]2Oc3c4c(C[C@H]5N(CC6CC6)CC[C@@]24[C@@]5(O)C1)ccc3O
: