Target
Mu-type opioid receptor
Ligand
BDBM50503608
Substrate
Meas. Tech.
ChEMBL_1811154 (CHEMBL4310614)
Ki
7.3±n/a nM
Citation
 Inagaki, MKume, MTamura, YHara, SGoto, YHaga, NHasegawa, TNakamura, TKoike, KOonishi, SKanemasa, TKai, H Discovery of naldemedine: A potent and orally available opioid receptor antagonist for treatment of opioid-induced adverse effects. Bioorg Med Chem Lett 29:73-77 (2019)  
Target
Name:
Mu-type opioid receptor
Synonyms:
M-OR-1 MOR-1 MUOR1 Mu opiate receptor OPRM1 hMOP | mu-type opioid receptor isoform MOR-1
Type:
G Protein-Coupled Receptor (GPCR)
Mol. Mass.:
44789.51
Organism:
Homo sapiens (Human)
Description:
P35372
Residue:
400
  
Inhibitor
Name:
BDBM50503608
Synonyms:
CHEMBL4445736
Type:
Small organic molecule
Emp. Form.:
C27H32N4O6
Mol. Mass.:
508.5662
SMILES:
[H][C@@]12Oc3c4c(C[C@@]5([H])N(CC6CC6)CC[C@@]14[C@@]5(O)CC(C(=O)NC(C)(C)c1nc(C)no1)=C2O)ccc3O
: