Target
5-hydroxytryptamine receptor 1B
Ligand
BDBM50054152
Substrate
Meas. Tech.
ChEMBL_1772 (CHEMBL616556)
IC50
4400±n/a nM
Citation
 Comoy, CMarot, CPodona, TBaudin, MLMorin-Allory, LGuillaumet, GPfeiffer, BCaignard, DHRenard, PRettori, MCAdam, GGuardiola-Lemaitre, B 3-amino-3,4-dihydro-2H-1-benzopyran derivatives as 5-HT1A receptor ligands and potential anxiolytic agents. 2. Synthesis and quantitative structure-activity relationship studies of spiro[pyrrolidine- and piperidine-2,3'(2'H)-benzopyrans] J Med Chem 39:4285-98 (1996)  
Target
Name:
5-hydroxytryptamine receptor 1B
Synonyms:
5-HT-1B 5-hydroxytryptamine receptor 1B (5HT1B) 5ht1b Serotonin 1 (5-HT1) receptor Serotonin receptor 1B
Type:
Protein
Mol. Mass.:
43173.33
Organism:
Rattus norvegicus (Rat)
Description:
P28564
Residue:
386
  
Inhibitor
Name:
BDBM50054152
Synonyms:
5-methoxyspiro[3,4-dihydro-2H-chromene-3,2'-(tetrahydro-1'H-pyrrole)] | CHEMBL137643
Type:
Small organic molecule
Emp. Form.:
C13H17NO2
Mol. Mass.:
219.2796
SMILES:
COc1cccc2OCC3(CCCN3)Cc12
: