Target
Gag-Pol polyprotein [489-587]
Ligand
BDBM50054165
Substrate
Meas. Tech.
ChEMBL_160750 (CHEMBL769064)
Ki
0.152000±n/a nM
Citation
 Wilkerson, WWAkamike, ECheatham, WWHollis, AYCollins, RDDeLucca, ILam, PYRu, Y HIV protease inhibitory bis-benzamide cyclic ureas: a quantitative structure-activity relationship analysis. J Med Chem 39:4299-312 (1996)  
Target
Name:
Gag-Pol polyprotein [489-587]
Synonyms:
Human immunodeficiency virus type 1 protease Pol polyprotein | gag-pol
Type:
Enzyme Subunit
Mol. Mass.:
10781.16
Organism:
Human immunodeficiency virus type 1
Description:
P04585[489-587]
Residue:
99
  
Inhibitor
Name:
BDBM50054165
Synonyms:
2-{3-[4,7-dibenzyl-5,6-dihydroxy-2-oxo-3-[3-(2-pyrimidinylcarbamoyl)benzyl]-(4R,5S,6S,7R)-1,3-diazepan-1-ylmethyl]phenylcarboxamido}pyrimidine | CHEMBL431017
Type:
Small organic molecule
Emp. Form.:
C43H40N8O5
Mol. Mass.:
748.8283
SMILES:
O[C@@H]1[C@@H](O)[C@@H](Cc2ccccc2)N(Cc2cccc(c2)C(=O)Nc2ncccn2)C(=O)N(Cc2cccc(c2)C(=O)Nc2ncccn2)[C@@H]1Cc1ccccc1
: