Target
Gag-Pol polyprotein [489-587]
Ligand
BDBM50054183
Substrate
Meas. Tech.
ChEMBL_160750 (CHEMBL769064)
Ki
0.027000±n/a nM
Citation
 Wilkerson, WWAkamike, ECheatham, WWHollis, AYCollins, RDDeLucca, ILam, PYRu, Y HIV protease inhibitory bis-benzamide cyclic ureas: a quantitative structure-activity relationship analysis. J Med Chem 39:4299-312 (1996)  
Target
Name:
Gag-Pol polyprotein [489-587]
Synonyms:
Human immunodeficiency virus type 1 protease Pol polyprotein | gag-pol
Type:
Enzyme Subunit
Mol. Mass.:
10781.16
Organism:
Human immunodeficiency virus type 1
Description:
P04585[489-587]
Residue:
99
  
Inhibitor
Name:
BDBM50054183
Synonyms:
2-{3-[4,7-dibenzyl-5,6-dihydroxy-3-[3-(4-methyl-2-pyridylcarbamoyl)benzyl]-2-oxo-(4R,5S,6S,7R)-1,3-diazepan-1-ylmethyl]phenylcarboxamido}-4-methylpyridine | CHEMBL85990
Type:
Small organic molecule
Emp. Form.:
C47H46N6O5
Mol. Mass.:
774.9053
SMILES:
Cc1ccnc(NC(=O)c2cccc(CN3[C@H](Cc4ccccc4)[C@H](O)[C@@H](O)[C@@H](Cc4ccccc4)N(Cc4cccc(c4)C(=O)Nc4cc(C)ccn4)C3=O)c2)c1
: