Target
Cannabinoid receptor 1
Ligand
BDBM50054470
Substrate
Meas. Tech.
ChEMBL_46807 (CHEMBL659694)
Ki
217±n/a nM
Citation
 Khanolkar, ADAbadji, VLin, SHill, WATaha, GAbouzid, KMeng, ZFan, PMakriyannis, A Head group analogs of arachidonylethanolamide, the endogenous cannabinoid ligand. J Med Chem 39:4515-9 (1996)  
Target
Name:
Cannabinoid receptor 1
Synonyms:
Brain-type cannabinoid receptor CB-R CNR1_RAT Cannabinoid receptor Cnr1 | Skr6
Type:
G Protein-Coupled Receptor (GPCR)
Mol. Mass.:
52856.55
Organism:
Rattus norvegicus (rat)
Description:
P20272
Residue:
473
  
Inhibitor
Name:
BDBM50054470
Synonyms:
(5Z,8Z,11Z,14Z)-Icosa-5,8,11,14-tetraenoic acid 4-hydroxy-benzylamide N-(4-hydroxybenzyl)icosa-5,8,11,14-tetraenamide
Type:
Small organic molecule
Emp. Form.:
C27H39NO2
Mol. Mass.:
409.6041
SMILES:
CCCCC\C=C/C\C=C/C\C=C/C\C=C/CCCC(=O)NCc1ccc(O)cc1
: