Target
Histone deacetylase 1
Ligand
BDBM50503970
Substrate
Meas. Tech.
ChEMBL_1812671 (CHEMBL4312245)
IC50
3.3±n/a nM
Citation
 Zhang, KLai, FLin, SJi, MZhang, JZhang, YJin, JFu, RWu, DTian, HXue, NSheng, LZou, XLi, YChen, XXu, H Design, Synthesis, and Biological Evaluation of 4-Methyl Quinazoline Derivatives as Anticancer Agents Simultaneously Targeting Phosphoinositide 3-Kinases and Histone Deacetylases. J Med Chem 62:6992-7014 (2019)  
Target
Name:
Histone deacetylase 1
Synonyms:
Cereblon/Histone deacetylase 1 HDAC1 Histone deacetylase 1 (HDAC1) RPD3L1
Type:
Enzyme
Mol. Mass.:
55090.27
Organism:
Homo sapiens (Human)
Description:
Q13547
Residue:
482
  
Inhibitor
Name:
BDBM50503970
Synonyms:
CHEMBL4568675
Type:
Small organic molecule
Emp. Form.:
C25H26FN7O4
Mol. Mass.:
507.5168
SMILES:
COc1ncc(cc1F)-c1cc(OCCCCN(C)c2ncc(cn2)C(=O)NO)c2ncnc(C)c2c1
: