Target
Histone deacetylase 6
Ligand
BDBM50503947
Substrate
Meas. Tech.
ChEMBL_1812680 (CHEMBL4312254)
IC50
17±n/a nM
Citation
 Zhang, KLai, FLin, SJi, MZhang, JZhang, YJin, JFu, RWu, DTian, HXue, NSheng, LZou, XLi, YChen, XXu, H Design, Synthesis, and Biological Evaluation of 4-Methyl Quinazoline Derivatives as Anticancer Agents Simultaneously Targeting Phosphoinositide 3-Kinases and Histone Deacetylases. J Med Chem 62:6992-7014 (2019)  
Target
Name:
Histone deacetylase 6
Synonyms:
Cereblon/Histone deacetylase 6 HDAC6 Histone deacetylase 6 (HDAC6) KIAA0901 | ORF Names:JM21
Type:
Chromatin regulator; hydrolase; repressor
Mol. Mass.:
131381.51
Organism:
Homo sapiens (Human)
Description:
Q9UBN7
Residue:
1215
  
Inhibitor
Name:
BDBM50503947
Synonyms:
CHEMBL4462577
Type:
Small organic molecule
Emp. Form.:
C23H23N7O4
Mol. Mass.:
461.4732
SMILES:
COc1ccc(cn1)-c1cc(OCCN(C)c2ncc(cn2)C(=O)NO)c2ncnc(C)c2c1
: