Target
Histone deacetylase 8
Ligand
BDBM50503943
Substrate
Meas. Tech.
ChEMBL_1812679 (CHEMBL4312253)
IC50
18±n/a nM
Citation
 Zhang, KLai, FLin, SJi, MZhang, JZhang, YJin, JFu, RWu, DTian, HXue, NSheng, LZou, XLi, YChen, XXu, H Design, Synthesis, and Biological Evaluation of 4-Methyl Quinazoline Derivatives as Anticancer Agents Simultaneously Targeting Phosphoinositide 3-Kinases and Histone Deacetylases. J Med Chem 62:6992-7014 (2019)  
Target
Name:
Histone deacetylase 8
Synonyms:
HD8 HDAC8_HUMAN Histone deacetylase 8 (HDAC-8) | Human HDAC8
Type:
Enzyme
Mol. Mass.:
41749.60
Organism:
Homo sapiens (Human)
Description:
Q9BY41
Residue:
377
  
Inhibitor
Name:
BDBM50503943
Synonyms:
CHEMBL4536105
Type:
Small organic molecule
Emp. Form.:
C22H25FN4O4
Mol. Mass.:
428.4567
SMILES:
COc1ncc(cc1F)-c1cc(OCCCCCCC(=O)NO)c2ncnc(C)c2c1
: